BDBM50115389 strongylophorine-8
SMILES [H][C@]12CC[C@](C)(O)[C@@H](Cc3cc(O)ccc3O)[C@]1(C)CC[C@@]1([H])[C@]3(C)CCC[C@]21COC3=O
InChI Key InChIKey=PRLHXGOJZIVTIS-VRRJBYJJSA-N
Data  1 IC50
  Tab Delimited (TSV)   2D SDfile   Computed 3D by Vconf -m prep SDfile
Find this compound or compounds like it in BindingDB:
Activity Spreadsheet -- Enzyme Inhibition Constant Data from BindingDB
Found 1 hit for monomerid = 50115389
TargetTyrosine-protein phosphatase non-receptor type 1(Homo sapiens (Human))
Tohoku Pharmaceutical University
Curated by ChEMBL
LigandPNGBDBM50115389(strongylophorine-8)
Affinity DataIC50:  2.12E+4nM. Assay description: Inhibition of PTP1B (unknown origin) pre-incubated for 10 mins before addition of p-nitrophenyl phosphate substrate and measured 30 mins post substra...
In DepthDetails ArticlePubMed