BDBM50115543 (2,6-Dimethyl-phenyl)-[4'-methyl-4-(4-trifluoromethyl-benzyl)-[1,4']bipiperidinyl-1'-yl]-methanone::CHEMBL107092
SMILES Cc1cccc(C)c1C(=O)N1CCC(C)(CC1)N1CCC(Cc2ccc(cc2)C(F)(F)F)CC1
InChI Key InChIKey=GZYLUVFSBIJQAU-UHFFFAOYSA-N
Data  2 KI
  Tab Delimited (TSV)   2D SDfile   Computed 3D by Vconf -m prep SDfile
Find this compound or compounds like it in BindingDB:
Activity Spreadsheet -- Enzyme Inhibition Constant Data from BindingDB
Found 2 hits for monomerid = 50115543
TargetC-C chemokine receptor type 5(Homo sapiens (Human))
Lindsley F. Kimball Research Institute
Curated by ChEMBL
LigandPNGBDBM50115543((2,6-Dimethyl-phenyl)-[4'-methyl-4-(4-trifluoromet...)
Affinity DataKi:  25nM. Assay description: Inhibition of RANTES binding to the human C-C chemokine receptor type 5 (CCR5)
In DepthDetails ArticlePubMed
TargetC-C chemokine receptor type 5(Mus musculus)
Schering-Plough Research Institute
Curated by ChEMBL
LigandPNGBDBM50115543((2,6-Dimethyl-phenyl)-[4'-methyl-4-(4-trifluoromet...)
Affinity DataKi:  25nM. Assay description: Inhibition of RANTES binding to Chemokine receptor type 5 receptor from NIH 3T3 cells
In DepthDetails ArticlePubMed