BDBM50115734 3-(3,4-Dioxo-3,4-dihydro-naphthalen-1-yl)-1H-indole-5-carboxylic acid::CHEMBL300119
SMILES OC(=O)c1ccc2[nH]cc(C3=CC(=O)C(=O)c4ccccc34)c2c1
InChI Key InChIKey=ALPUWNZRHBMXIQ-UHFFFAOYSA-N
Data  1 IC50
  Tab Delimited (TSV)   2D SDfile   Computed 3D by Vconf -m prep SDfile
Find this compound or compounds like it in BindingDB:
Activity Spreadsheet -- Enzyme Inhibition Constant Data from BindingDB
Found 1 hit for monomerid = 50115734
TargetTyrosine-protein phosphatase non-receptor type 1(Homo sapiens (Human))
Korea Research Institute Of Chemical Technology
Curated by ChEMBL
LigandPNGBDBM50115734(3-(3,4-Dioxo-3,4-dihydro-naphthalen-1-yl)-1H-indol...)
Affinity DataIC50:  3.00E+3nM. Assay description: In vitro inhibitory activity against recombinant human protein-tyrosine phosphatase 1B (PTP1B) using fluoreacein diphosphate (FDP) as a substrate
In DepthDetails ArticlePubMed