BDBM50115927 4-[3-(4-Cyano-benzyl)-2-methyl-3H-imidazol-4-ylmethyl]-piperazine-1-carboxylic acid 2-trifluoromethoxy-benzyl ester::CHEMBL293639
SMILES Cc1ncc(CN2CCN(CC2)C(=O)OCc2ccccc2OC(F)(F)F)n1Cc1ccc(cc1)C#N
InChI Key InChIKey=NKNMRYCDVOOEKZ-UHFFFAOYSA-N
Data  4 IC50
  Tab Delimited (TSV)   2D SDfile   Computed 3D by Vconf -m prep SDfile
Find this compound or compounds like it in BindingDB:
Activity Spreadsheet -- Enzyme Inhibition Constant Data from BindingDB
Found 4 hits for monomerid = 50115927
TargetProtein farnesyltransferase subunit beta/geranylgeranyltransferase type-1 subunit alpha(Homo sapiens (Human))
Merck Research Laboratories
Curated by ChEMBL
LigandPNGBDBM50115927(4-[3-(4-Cyano-benzyl)-2-methyl-3H-imidazol-4-ylmet...)
Affinity DataIC50:  0.330nM. Assay description: Inhibition of Farnesyl protein transferase radiolabel [1-3H] incorporation
In DepthDetails ArticlePubMed
LigandPNGBDBM50115927(4-[3-(4-Cyano-benzyl)-2-methyl-3H-imidazol-4-ylmet...)
Affinity DataIC50:  660nM. Assay description: Inhibition of [1-3H]-GGPP incorporation into biotinylated K4B-Ras peptide by geranylgeranyl transferase in the presence of 5 mM ATP
In DepthDetails ArticlePubMed
LigandPNGBDBM50115927(4-[3-(4-Cyano-benzyl)-2-methyl-3H-imidazol-4-ylmet...)
Affinity DataIC50:  53nM. Assay description: Inhibition of [1-3H]-GGPP incorporation into biotinylated K4B-Ras peptide by geranylgeranyl transferase in the presence of 5 mM ATP
In DepthDetails ArticlePubMed
TargetProtein farnesyltransferase subunit beta/geranylgeranyltransferase type-1 subunit alpha(Homo sapiens (Human))
Merck Research Laboratories
Curated by ChEMBL
LigandPNGBDBM50115927(4-[3-(4-Cyano-benzyl)-2-methyl-3H-imidazol-4-ylmet...)
Affinity DataIC50:  0.340nM. Assay description: Displacement of radiolabeled farnesyl transferase inhibitor
In DepthDetails ArticlePubMed