BDBM50116285 (2-Aminomethyl-3H-benzoimidazol-5-yl)-cyclohex-3-enylmethyl-amine::CHEMBL70817
SMILES NCc1nc2ccc(NCC3CCC=CC3)cc2[nH]1
InChI Key InChIKey=YVZXWFDVDWLMEK-UHFFFAOYSA-N
Data  1 IC50
  Tab Delimited (TSV)   2D SDfile   Computed 3D by Vconf -m prep SDfile
Find this compound or compounds like it in BindingDB:
Activity Spreadsheet -- Enzyme Inhibition Constant Data from BindingDB
Found 1 hit for monomerid = 50116285
TargetMatrix metalloproteinase-9(Mus musculus)
University Of California
Curated by ChEMBL
LigandPNGBDBM50116285((2-Aminomethyl-3H-benzoimidazol-5-yl)-cyclohex-3-e...)
Affinity DataIC50:  9.20E+4nM. Assay description: Inhibitory concentration was determined against murine gelatinase B
In DepthDetails ArticlePubMed