BDBM50116706 CHEMBL3608694
SMILES CC(C)c1cccc(NC(=O)c2ccccc2N)c1
InChI Key InChIKey=MVETYYNURUWNBI-UHFFFAOYSA-N
Data  1 IC50
  Tab Delimited (TSV)   2D SDfile   Computed 3D by Vconf -m prep SDfile
Find this compound or compounds like it in BindingDB:
Activity Spreadsheet -- Enzyme Inhibition Constant Data from BindingDB
Found 1 hit for monomerid = 50116706
TargetAcyl-CoA (8-3)-desaturase(Homo sapiens (Human))
Lexicon Pharmaceuticals
Curated by ChEMBL
LigandPNGBDBM50116706(CHEMBL3608694)
Affinity DataIC50:  843nM. Assay description: Inhibition of liver delta-5 desaturase (unknown origin)
In DepthDetails ArticlePubMed