BDBM50116815 4-Sulfamoyloxy-benzoic acid hexyl ester::CHEMBL78282
SMILES CCCCCCOC(=O)c1ccc(OS(N)(=O)=O)cc1
InChI Key InChIKey=PJIPMHPXRQOHKO-UHFFFAOYSA-N
Data  2 IC50
  Tab Delimited (TSV)   2D SDfile   Computed 3D by Vconf -m prep SDfile
Find this compound or compounds like it in BindingDB:
Activity Spreadsheet -- Enzyme Inhibition Constant Data from BindingDB
Found 2 hits for monomerid = 50116815
TargetSteryl-sulfatase(Homo sapiens (Human))
Kingston University
Curated by ChEMBL
LigandPNGBDBM50116815(4-Sulfamoyloxy-benzoic acid hexyl ester | CHEMBL78...)
Affinity DataIC50:  3.80E+3nM. Assay description: Inhibition of estrone sulfatase
In DepthDetails ArticlePubMed
TargetSteryl-sulfatase(Homo sapiens (Human))
Kingston University
Curated by ChEMBL
LigandPNGBDBM50116815(4-Sulfamoyloxy-benzoic acid hexyl ester | CHEMBL78...)
Affinity DataIC50:  3.80E+3nM. Assay description: Inhibitory activity against Estrone Sulfatase
In DepthDetails ArticlePubMed