BDBM50117015 (S)-2-{[1-(4-Cyano-butyl)-cyclopentanecarbonyl]-amino}-3-[4-(2,6-dichloro-benzoylamino)-phenyl]-propionic acid::CHEMBL311546
SMILES OC(=O)[C@H](Cc1ccc(NC(=O)c2c(Cl)cccc2Cl)cc1)NC(=O)C1(CCCCC#N)CCCC1
InChI Key InChIKey=RBTXBEVPBKTAJE-QFIPXVFZSA-N
Data  2 IC50
  Tab Delimited (TSV)   2D SDfile   Computed 3D by Vconf -m prep SDfile
Find this compound or compounds like it in BindingDB:
Activity Spreadsheet -- Enzyme Inhibition Constant Data from BindingDB
Found 2 hits for monomerid = 50117015
TargetIntegrin alpha-4/beta-1(Homo sapiens (Human))
Roche Research Center
Curated by ChEMBL
LigandPNGBDBM50117015((S)-2-{[1-(4-Cyano-butyl)-cyclopentanecarbonyl]-am...)
Affinity DataIC50:  39nM. Assay description: Inhibitory binding concentration determined against VCAM/VLA-4 in Ramos
In DepthDetails ArticlePubMed
TargetIntegrin alpha-4/beta-1(Homo sapiens (Human))
Roche Research Center
Curated by ChEMBL
LigandPNGBDBM50117015((S)-2-{[1-(4-Cyano-butyl)-cyclopentanecarbonyl]-am...)
Affinity DataIC50:  0.520nM. Assay description: Inhibitory binding concentration determined against VCAM/VLA-4 in ELISA
In DepthDetails ArticlePubMed