BDBM50117115 3-{[(aminosulfonyl)amino]sulfonyl}benzoic acid::CHEMBL120775
SMILES NS(=O)(=O)NS(=O)(=O)c1cccc(c1)C(O)=O
InChI Key InChIKey=AWJGQWVREDIANS-UHFFFAOYSA-N
Data  2 KI
  Tab Delimited (TSV)   2D SDfile   Computed 3D by Vconf -m prep SDfile
Find this compound or compounds like it in BindingDB:
Activity Spreadsheet -- Enzyme Inhibition Constant Data from BindingDB
Found 2 hits for monomerid = 50117115
TargetCarbonic anhydrase 1(Homo sapiens (Human))
Universit£
Curated by ChEMBL
LigandPNGBDBM50117115(3-{[(aminosulfonyl)amino]sulfonyl}benzoic acid | C...)
Affinity DataKi:  6nM. Assay description: Inhibitory activity against human Carbonic anhydrase I (hCA I)
In DepthDetails ArticlePubMed
TargetCarbonic anhydrase 2(Homo sapiens (Human))
Universit£
Curated by ChEMBL
LigandPNGBDBM50117115(3-{[(aminosulfonyl)amino]sulfonyl}benzoic acid | C...)
Affinity DataKi:  10nM. Assay description: Inhibitory activity against human Carbonic anhydrase II (hCA II)
In DepthDetails ArticlePubMed