BDBM50117190 CHEMBL3613339
SMILES OC(=O)C12CC3CC(C1)C(Oc1ccc(cc1)C(=O)NCCNC(=O)c1ccc4ccccc4c1)C(C3)C2
InChI Key InChIKey=WJEXMOCWZSKYTJ-UHFFFAOYSA-N
Data  2 IC50
  Tab Delimited (TSV)   2D SDfile   Computed 3D by Vconf -m prep SDfile
Find this compound or compounds like it in BindingDB:
Activity Spreadsheet -- Enzyme Inhibition Constant Data from BindingDB
Found 2 hits for monomerid = 50117190
TargetDiacylglycerol O-acyltransferase 1(Homo sapiens (Human))
Korea Research Institute Of Chemical Technology
Curated by ChEMBL
LigandPNGBDBM50117190(CHEMBL3613339)
Affinity DataIC50:  34nM. Assay description: Inhibition of human DGAT1 expressed in human Hep3B cells incubated for 60 mins using didecanoyl glycerol and [14C]decanoyl-CoA substrate by liquid sc...
In DepthDetails ArticlePubMed
TargetDiacylglycerol O-acyltransferase 1(Mus musculus (mouse))
Korea Research Institute Of Chemical Technology
Curated by ChEMBL
LigandPNGBDBM50117190(CHEMBL3613339)
Affinity DataIC50:  22nM. Assay description: Inhibition of mouse DGAT1 incubated for 60 mins using didecanoyl glycerol and [14C]decanoyl-CoA substrate by liquid scintillation counting and lumino...
In DepthDetails ArticlePubMed