BDBM50117200 CHEMBL3613343
SMILES OC(=O)CC1C2CC3CC1CC(C3)(C2)Oc1ccc(cc1)C(=O)NCCNC(=O)c1ccc2ccccc2c1
InChI Key InChIKey=VQKUNGNAWOVCCL-UHFFFAOYSA-N
Data  1 IC50
  Tab Delimited (TSV)   2D SDfile   Computed 3D by Vconf -m prep SDfile
Find this compound or compounds like it in BindingDB:
Activity Spreadsheet -- Enzyme Inhibition Constant Data from BindingDB
Found 1 hit for monomerid = 50117200
TargetDiacylglycerol O-acyltransferase 1(Homo sapiens (Human))
Korea Research Institute Of Chemical Technology
Curated by ChEMBL
LigandPNGBDBM50117200(CHEMBL3613343)
Affinity DataIC50: >500nM. Assay description: Inhibition of human DGAT1 expressed in human Hep3B cells incubated for 60 mins using didecanoyl glycerol and [14C]decanoyl-CoA substrate by liquid sc...
In DepthDetails ArticlePubMed