BDBM50117783 CHEMBL87792::N-(2-Dimethylamino-ethyl)-2-[2-(4-fluoro-benzylsulfanyl)-5-(1-methyl-1H-pyrazol-4-ylmethyl)-4-oxo-4H-pyrimidin-1-yl]-N-(4'-trifluoromethyl-biphenyl-4-ylmethyl)-acetamide
SMILES CN(C)CCN(Cc1ccc(cc1)-c1ccc(cc1)C(F)(F)F)C(=O)Cn1cc(Cc2cnn(C)c2)c(=O)nc1SCc1ccc(F)cc1
InChI Key InChIKey=SQCCCUOOWHMPBF-UHFFFAOYSA-N
Data  2 IC50
  Tab Delimited (TSV)   2D SDfile   Computed 3D by Vconf -m prep SDfile
Find this compound or compounds like it in BindingDB:
Activity Spreadsheet -- Enzyme Inhibition Constant Data from BindingDB
Found 2 hits for monomerid = 50117783
TargetPlatelet-activating factor acetylhydrolase(Homo sapiens (Human))
Glaxosmithkline
Curated by ChEMBL
LigandPNGBDBM50117783(CHEMBL87792 | N-(2-Dimethylamino-ethyl)-2-[2-(4-fl...)
Affinity DataIC50:  0.700nM. Assay description: Inhibitory concentration against Lipoprotein-Associated Phospholipase A2 (Lp-PLA2) was estimated
In DepthDetails ArticlePubMed
TargetCytochrome P450 3A4(Homo sapiens (Human))
Glaxosmithkline
Curated by ChEMBL
LigandPNGBDBM50117783(CHEMBL87792 | N-(2-Dimethylamino-ethyl)-2-[2-(4-fl...)
Affinity DataIC50:  3.00E+4nM. Assay description: Inhibition of cytochrome P450 3A4
In DepthDetails ArticlePubMed