BDBM50118052 1,1,1-Trifluoro-3-{(3-fluoro-phenyl)-[3-(1,1,2,2-tetrafluoro-ethoxy)-benzyl]-amino}-propan-2-ol::1,1,1-trifluoro-3-((3-fluorophenyl)(3-(1,1,2,2-tetrafluoroethoxy)benzyl)amino)propan-2-ol::CHEMBL127951
SMILES OC(CN(Cc1cccc(OC(F)(F)C(F)F)c1)c1cccc(F)c1)C(F)(F)F
InChI Key InChIKey=ZOGDIXCANQGWLS-UHFFFAOYSA-N
Data  2 IC50
  Tab Delimited (TSV)   2D SDfile   Computed 3D by Vconf -m prep SDfile
Find this compound or compounds like it in BindingDB:
Activity Spreadsheet -- Enzyme Inhibition Constant Data from BindingDB
Found 2 hits for monomerid = 50118052
TargetCholesteryl ester transfer protein(Oryctolagus cuniculus)
Al-Zaytoonah Private University Of Jordan
Curated by ChEMBL
LigandPNGBDBM50118052(1,1,1-Trifluoro-3-{(3-fluoro-phenyl)-[3-(1,1,2,2-t...)
Affinity DataIC50:  4.50E+3nM. Assay description: Inhibition of CETP in rabbit serum after 1 hr by fluorescent cholesteryl esters transfer assay
In DepthDetails ArticlePubMed
TargetCholesteryl ester transfer protein(Homo sapiens (Human))
Pharmacia
Curated by ChEMBL
LigandPNGBDBM50118052(1,1,1-Trifluoro-3-{(3-fluoro-phenyl)-[3-(1,1,2,2-t...)
Affinity DataIC50:  4.50E+3nM. Assay description: Concentration required for 50% inhibition of cholesteryl ester transfer protein in presence of buffer.
In DepthDetails ArticlePubMed