BDBM50118197 3'-(tert-butyl)-4,4',9',14'-tetrahydroxy-2-methoxy-10'-methylspiro[tetrahydrofuran-3,2'-(6',12'-dioxatetracyclo[6.6.0.01,5.09,13]tetradecane)]-5,7',11'-trione::CHEMBL441286
SMILES COC1OC(=O)[C@H](O)C11[C@@H]([C@@H](O)C2OC(=O)C3[C@@]4(O)[C@H](C)C(=O)O[C@H]4[C@H](O)[C@]123)C(C)(C)C
InChI Key InChIKey=UGWLJQKASRMPFQ-OKCXYNBISA-N
Data  1 KI
  Tab Delimited (TSV)   2D SDfile   Computed 3D by Vconf -m prep SDfile
Find this compound or compounds like it in BindingDB:
Activity Spreadsheet -- Enzyme Inhibition Constant Data from BindingDB
Found 1 hit for monomerid = 50118197
TargetPlatelet-activating factor receptor(Mus musculus)
Columbia University
Curated by ChEMBL
LigandPNGBDBM50118197(3'-(tert-butyl)-4,4',9',14'-tetrahydroxy-2-methoxy...)
Affinity DataKi:  1.26E+4nM. Assay description: Displacement of [3H]-WEB 2086 from Platelet activating factor receptor (PAF)
In DepthDetails ArticlePubMed