BDBM50118203 8-(tert-butyl)-9,12,17-trihydroxy-16-methyl-6-[4-(3-trifluoromethyl-3H-1,2-diaziren-3-yl)benzyloxy]-2,4,14,19-tetraoxahexacyclo[8.7.2.01,11.03,7.07,11.013,17]nonadecane-5,15,18-trione::CHEMBL335310
SMILES C[C@@H]1C(=O)O[C@H]2[C@H](O)[C@]34C5OC(=O)C3(OC3OC(=O)[C@H](OCc6ccc(cc6)C6(N=N6)C(F)(F)F)C43[C@@H]([C@H]5O)C(C)(C)C)[C@@]12O
InChI Key InChIKey=JJABSUARQICJFK-JEUIAGQCSA-N
Data  1 KI
  Tab Delimited (TSV)   2D SDfile   Computed 3D by Vconf -m prep SDfile
Find this compound or compounds like it in BindingDB:
Activity Spreadsheet -- Enzyme Inhibition Constant Data from BindingDB
Found 1 hit for monomerid = 50118203
TargetPlatelet-activating factor receptor(Mus musculus)
Columbia University
Curated by ChEMBL
LigandPNGBDBM50118203(8-(tert-butyl)-9,12,17-trihydroxy-16-methyl-6-[4-(...)
Affinity DataKi:  470nM. Assay description: Displacement of [3H]-WEB 2086 from Platelet activating factor receptor (PAF)
In DepthDetails ArticlePubMed