BDBM50118332 1-(benzo[b]thiophen-3-yl)-3-(4-(quinolin-6-yl)piperazin-1-yl)propan-1-ol::1-Benzo[b]thiophen-3-yl-3-(4-quinolin-6-yl-piperazin-1-yl)-propan-1-ol::CHEMBL334637
SMILES OC(CCN1CCN(CC1)c1ccc2ncccc2c1)c1csc2ccccc12
InChI Key InChIKey=SMGADQUWFYVSES-UHFFFAOYSA-N
Data  3 KI
  Tab Delimited (TSV)   2D SDfile   Computed 3D by Vconf -m prep SDfile
Find this compound or compounds like it in BindingDB:
Activity Spreadsheet -- Enzyme Inhibition Constant Data from BindingDB
Found 3 hits for monomerid = 50118332
TargetSodium-dependent serotonin transporter(Rattus norvegicus (rat))
Universidad De Navarra
Curated by ChEMBL
LigandPNGBDBM50118332(1-(benzo[b]thiophen-3-yl)-3-(4-(quinolin-6-yl)pipe...)
Affinity DataKi:  2.20nM. Assay description: Binding affinity towards Serotonin transporter (5-HTT) in rat frontal cortex homogenates
In DepthDetails ArticlePubMed
Target5-hydroxytryptamine receptor 1A(Rattus norvegicus (rat))
Universidad De Navarra
Curated by ChEMBL
LigandPNGBDBM50118332(1-(benzo[b]thiophen-3-yl)-3-(4-(quinolin-6-yl)pipe...)
Affinity DataKi:  546nM. Assay description: Binding affinity towards 5-hydroxytryptamine 1A receptor in rat frontal cortex homogenates
In DepthDetails ArticlePubMed
Target5-hydroxytryptamine receptor 1A(Homo sapiens (Human))
Universidade Federal Da Para£Ba
Curated by ChEMBL
LigandPNGBDBM50118332(1-(benzo[b]thiophen-3-yl)-3-(4-(quinolin-6-yl)pipe...)
Affinity DataKi:  550nM. Assay description: Antagonist activity at 5HT1A
In DepthDetails ArticlePubMed