BDBM50118387 CHEMBL3613308
SMILES CNS(=O)(=O)c1ccc(N2CCOCC2)c(Nc2ncnc3[nH]c(Br)cc23)c1
InChI Key InChIKey=CVKDTMOMVBGJJS-UHFFFAOYSA-N
Data  3 IC50
  Tab Delimited (TSV)   2D SDfile   Computed 3D by Vconf -m prep SDfile
Find this compound or compounds like it in BindingDB:
Activity Spreadsheet -- Enzyme Inhibition Constant Data from BindingDB
Found 3 hits for monomerid = 50118387
TargetSerine/threonine-protein kinase TNNI3K(Homo sapiens (Human))
Glaxosmithkline
Curated by ChEMBL
LigandPNGBDBM50118387(CHEMBL3613308)
Affinity DataIC50:  398nM. Assay description: Inhibition of human myc-tagged TNNI3K autophosphorylation overexpressed in HEKMSRII cells preincubated for 30 mins followed by pervanadate solution a...
In DepthDetails ArticlePubMed
TargetSerine/threonine-protein kinase B-raf(Homo sapiens (Human))
Glaxosmithkline
Curated by ChEMBL
LigandPNGBDBM50118387(CHEMBL3613308)
Affinity DataIC50:  8nM. Assay description: Inhibition of His6-tagged full length BRAF V600E mutant (2 to 766 residues) (unknown origin) expressed in Baculovirus expression system by BRAMA meth...
In DepthDetails ArticlePubMed
TargetSerine/threonine-protein kinase TNNI3K(Homo sapiens (Human))
Glaxosmithkline
Curated by ChEMBL
LigandPNGBDBM50118387(CHEMBL3613308)
Affinity DataIC50:  126nM. Assay description: Displacement of 5-({[2-({[3-({4-[(5-hydroxy-2-methylphenyl)amino]-2-pyrimidinyl}amino)phenyl]carbonyl}amino)-ethyl]amino}carbonyl)-2-(6-hydroxy-3-oxo...
In DepthDetails ArticlePubMed