BDBM50118413 CHEMBL3612662
SMILES CNS(=O)(=O)c1cccc(Nc2ncnc3[nH]cc(C(C)C)c23)c1
InChI Key InChIKey=MGDKKLPMXIEOJN-UHFFFAOYSA-N
Data  2 IC50
  Tab Delimited (TSV)   2D SDfile   Computed 3D by Vconf -m prep SDfile
Find this compound or compounds like it in BindingDB:
Activity Spreadsheet -- Enzyme Inhibition Constant Data from BindingDB
Found 2 hits for monomerid = 50118413
TargetSerine/threonine-protein kinase B-raf(Homo sapiens (Human))
Glaxosmithkline
Curated by ChEMBL
LigandPNGBDBM50118413(CHEMBL3612662)
Affinity DataIC50:  79nM. Assay description: Inhibition of His6-tagged full length BRAF V600E mutant (2 to 766 residues) (unknown origin) expressed in Baculovirus expression system by BRAMA meth...
In DepthDetails ArticlePubMed
TargetSerine/threonine-protein kinase TNNI3K(Homo sapiens (Human))
Glaxosmithkline
Curated by ChEMBL
LigandPNGBDBM50118413(CHEMBL3612662)
Affinity DataIC50:  126nM. Assay description: Displacement of 5-({[2-({[3-({4-[(5-hydroxy-2-methylphenyl)amino]-2-pyrimidinyl}amino)phenyl]carbonyl}amino)-ethyl]amino}carbonyl)-2-(6-hydroxy-3-oxo...
In DepthDetails ArticlePubMed