BDBM50118523 CHEMBL3617079
SMILES CCCc1cc(=O)n2nc(NCc3ccc(Br)cc3F)c(C#N)c2[nH]1
InChI Key InChIKey=CAMWPIUNZCCFGO-UHFFFAOYSA-N
Data  2 IC50
  Tab Delimited (TSV)   2D SDfile   Computed 3D by Vconf -m prep SDfile
Find this compound or compounds like it in BindingDB:
Activity Spreadsheet -- Enzyme Inhibition Constant Data from BindingDB
Found 2 hits for monomerid = 50118523
TargetBranched-chain-amino-acid aminotransferase, mitochondrial(Homo sapiens (Human))
Glaxosmithkline
Curated by ChEMBL
LigandPNGBDBM50118523(CHEMBL3617079)
Affinity DataIC50:  25nM. Assay description: Inhibition of human cloned BCATm expressed in Escherichia coli BL21 DE3 assessed as L-glutamate production from alpha-ketoglutarate after 10 mins by ...
In DepthDetails ArticlePubMed
TargetBranched-chain-amino-acid aminotransferase, mitochondrial(Homo sapiens (Human))
Glaxosmithkline
Curated by ChEMBL
LigandPNGBDBM50118523(CHEMBL3617079)
Affinity DataIC50:  158nM. Assay description: Inhibition of BCATm in differentiated primary human adipocytes assessed as remaining leucine level by reversed phase HPLC analysis
In DepthDetails ArticlePubMed