BDBM50118603 4-(2-(bis(4-fluorophenyl)methoxy)ethyl)-1-(3-phenylprop-2-ynyl)piperidine::4-{2-[Bis-(4-fluoro-phenyl)-methoxy]-ethyl}-1-(3-phenyl-prop-2-ynyl)-piperidine::CHEMBL136249
SMILES Fc1ccc(cc1)C(OCCC1CCN(CC#Cc2ccccc2)CC1)c1ccc(F)cc1
InChI Key InChIKey=QGSJJLSDNPKNBC-UHFFFAOYSA-N
Data  4 KI
  Tab Delimited (TSV)   2D SDfile   Computed 3D by Vconf -m prep SDfile
Find this compound or compounds like it in BindingDB:
Activity Spreadsheet -- Enzyme Inhibition Constant Data from BindingDB
Found 4 hits for monomerid = 50118603
TargetSodium-dependent dopamine transporter(Rattus norvegicus (rat))
University Heights
Curated by ChEMBL
LigandPNGBDBM50118603(4-(2-(bis(4-fluorophenyl)methoxy)ethyl)-1-(3-pheny...)
Affinity DataKi:  5.30nM. Assay description: Displacement of [125I]RTI55 from DAT in rat brain synaptosomes
In DepthDetails ArticlePubMed
TargetSodium-dependent dopamine transporter(Homo sapiens (Human))
Niddk
Curated by ChEMBL
LigandPNGBDBM50118603(4-(2-(bis(4-fluorophenyl)methoxy)ethyl)-1-(3-pheny...)
Affinity DataKi:  5.30nM. Assay description: Binding affinity of the compound towards dopamine transporter (DAT) by using [125I]-RTI-55 radioligand
In DepthDetails ArticlePubMed
TargetSodium-dependent serotonin transporter(Rattus norvegicus (rat))
University Heights
Curated by ChEMBL
LigandPNGBDBM50118603(4-(2-(bis(4-fluorophenyl)methoxy)ethyl)-1-(3-pheny...)
Affinity DataKi:  164nM. Assay description: Displacement of [125I]RTI55 from SERT in rat brain synaptosomes
In DepthDetails ArticlePubMed
TargetSodium-dependent serotonin transporter(Homo sapiens (Human))
Niddk
Curated by ChEMBL
LigandPNGBDBM50118603(4-(2-(bis(4-fluorophenyl)methoxy)ethyl)-1-(3-pheny...)
Affinity DataKi:  164nM. Assay description: Binding affinity for serotonin transporter (SERT) using [125I]-RTI-55
In DepthDetails ArticlePubMed