BDBM50118611 CHEMBL3617103
SMILES CCCc1cc(=O)n2nc(NCCc3ccc(Cl)cc3)c(C#N)c2[nH]1
InChI Key InChIKey=JNCFWBHOUIQEOO-UHFFFAOYSA-N
Data  2 IC50
  Tab Delimited (TSV)   2D SDfile   Computed 3D by Vconf -m prep SDfile
Find this compound or compounds like it in BindingDB:
Activity Spreadsheet -- Enzyme Inhibition Constant Data from BindingDB
Found 2 hits for monomerid = 50118611
TargetBranched-chain-amino-acid aminotransferase, mitochondrial(Homo sapiens (Human))
Glaxosmithkline
Curated by ChEMBL
LigandPNGBDBM50118611(CHEMBL3617103)
Affinity DataIC50:  251nM. Assay description: Inhibition of human cloned BCATm expressed in Escherichia coli BL21 DE3 assessed as L-glutamate production from alpha-ketoglutarate after 10 mins by ...
In DepthDetails ArticlePubMed
TargetBranched-chain-amino-acid aminotransferase, mitochondrial(Homo sapiens (Human))
Glaxosmithkline
Curated by ChEMBL
LigandPNGBDBM50118611(CHEMBL3617103)
Affinity DataIC50:  1.00E+3nM. Assay description: Inhibition of BCATm in differentiated primary human adipocytes assessed as remaining leucine level by reversed phase HPLC analysis
In DepthDetails ArticlePubMed