BDBM50119000 (2,3-Dihydro-benzo[1,4]dioxin-6-yl)-(6-hydroxy-3-naphthalen-1-yl-benzofuran-2-yl)-methanone::CHEMBL329312
SMILES Oc1ccc2c(c(oc2c1)C(=O)c1ccc2OCCOc2c1)-c1cccc2ccccc12
InChI Key InChIKey=GCCYLGSANMFBDL-UHFFFAOYSA-N
Data  2 IC50
  Tab Delimited (TSV)   2D SDfile   Computed 3D by Vconf -m prep SDfile
Find this compound or compounds like it in BindingDB:
Activity Spreadsheet -- Enzyme Inhibition Constant Data from BindingDB
Found 2 hits for monomerid = 50119000
TargetEstrogen receptor beta(Rattus norvegicus)
Bayer Research Center
Curated by ChEMBL
LigandPNGBDBM50119000((2,3-Dihydro-benzo[1,4]dioxin-6-yl)-(6-hydroxy-3-n...)
Affinity DataIC50:  2.20E+4nM. Assay description: Binding to Estrogen receptor- beta (ER beta) receptor
In DepthDetails ArticlePubMed
TargetEstrogen receptor(RAT)
Bayer Research Center
Curated by ChEMBL
LigandPNGBDBM50119000((2,3-Dihydro-benzo[1,4]dioxin-6-yl)-(6-hydroxy-3-n...)
Affinity DataIC50:  140nM. Assay description: Binding to Estrogen receptor- alpha (ER alpha) receptor
In DepthDetails ArticlePubMed