BDBM50119049 Biotinylated E-76 peptide analogue::CHEMBL439285
SMILES CC[C@H](C)[C@H]1NC(=O)[C@H](CCCNC(N)=N)NC(=O)[C@H]2CCCN2C(=O)[C@H](CC(N)=O)NC(=O)[C@@H](CC(O)=O)NC(=O)[C@@H](CSSC[C@@H](NC(=O)[C@@H](Cc2ccc(O)cc2)NC(=O)[C@H](Cc2c[nH]c3ccccc23)NC(=O)[C@@H](CCCNC(N)=N)NC(=O)[C@H](CC(O)=O)NC1=O)C(=O)N[C@@H](CCC(N)=O)C(=O)N[C@@H](Cc1ccccc1)C(=O)N[C@@H](C(C)C)C(=O)N[C@@H](CCC(O)=O)C(=O)NCC(N)=O)NC(=O)[C@H](CC(C)C)NC(=O)[C@H](C)NCc1cccc2ccccc12
InChI Key InChIKey=ZONWJXVPELVURD-BMGQWBBKSA-N
Data  1 IC50
  Tab Delimited (TSV)   2D SDfile   Computed 3D by Vconf -m prep SDfile
Find this compound or compounds like it in BindingDB:
Activity Spreadsheet -- Enzyme Inhibition Constant Data from BindingDB
Found 1 hit for monomerid = 50119049
TargetCoagulation factor VII(Homo sapiens (Human))
Genentech
Curated by ChEMBL
LigandPNGBDBM50119049(Biotinylated E-76 peptide analogue | CHEMBL439285)
Affinity DataIC50:  1.60nM. Assay description: Inhibition of amino terminally biotinylated E-76 peptide binding to immobilized fVIIa
In DepthDetails ArticlePubMed