BDBM50119283 3-Methoxy-5,6,7,8-tetrahydro-10-thia-5,8-diaza-benzo[a]azulen-9-one::CHEMBL319171
SMILES COc1ccc2sc3c(NCCNC3=O)c2c1
InChI Key InChIKey=YLQOELRYUQBERL-UHFFFAOYSA-N
Data  3 IC50
  Tab Delimited (TSV)   2D SDfile   Computed 3D by Vconf -m prep SDfile
Find this compound or compounds like it in BindingDB:
Activity Spreadsheet -- Enzyme Inhibition Constant Data from BindingDB
Found 3 hits for monomerid = 50119283
TargetMAP kinase-activated protein kinase 2(Homo sapiens (Human))
Pfizer
Curated by ChEMBL
LigandPNGBDBM50119283(3-Methoxy-5,6,7,8-tetrahydro-10-thia-5,8-diaza-ben...)
Affinity DataIC50:  180nM. Assay description: Inhibition of MK2
In DepthDetails ArticlePubMed
TargetMAP kinase-activated protein kinase 2(Homo sapiens (Human))
Pfizer
Curated by ChEMBL
LigandPNGBDBM50119283(3-Methoxy-5,6,7,8-tetrahydro-10-thia-5,8-diaza-ben...)
Affinity DataIC50:  1.40E+3nM. Assay description: Inhibition of MK2 in human U937 cells assessed as blockade of LPS-stimulated TNFalpha production
In DepthDetails ArticlePubMed
TargetCyclin-dependent kinase 1(Homo sapiens (Human))
Pfizer
Curated by ChEMBL
LigandPNGBDBM50119283(3-Methoxy-5,6,7,8-tetrahydro-10-thia-5,8-diaza-ben...)
Affinity DataIC50:  160nM. Assay description: Inhibition of CDK2
In DepthDetails ArticlePubMed