BDBM50119350 CHEMBL3623274
SMILES COc1ccc(\C=C2\NC(=O)NC2=O)cc1C
InChI Key InChIKey=BDIDSZSQSQZXNC-UHFFFAOYSA-N
Data  1 EC50
  Tab Delimited (TSV)   2D SDfile   Computed 3D by Vconf -m prep SDfile
Find this compound or compounds like it in BindingDB:
Activity Spreadsheet -- Enzyme Inhibition Constant Data from BindingDB
Found 1 hit for monomerid = 50119350
TargetDNA topoisomerase 1(Homo sapiens (Human))
Shiv Nadar University
Curated by ChEMBL
LigandPNGBDBM50119350(CHEMBL3623274)
Affinity DataEC50: >1.00E+5nM. Assay description: Inhibition of wild type recombinant human Top1 expressed in baculovirus infected insect Sf9 cells assessed as decrease in supercoiled pBS(SK+) DNA is...
In DepthDetails ArticlePubMed