BDBM50119513 CHEMBL425285
SMILES CCCc1c(nnn1Cc1ccccc1)C(=O)NCCCCN1CCN(CC1)c1cccc(Cl)c1Cl
InChI Key InChIKey=HEKOGNYDDZRAAJ-UHFFFAOYSA-N
Data  2 KI
  Tab Delimited (TSV)   2D SDfile   Computed 3D by Vconf -m prep SDfile
Find this compound or compounds like it in BindingDB:
Activity Spreadsheet -- Enzyme Inhibition Constant Data from BindingDB
Found 2 hits for monomerid = 50119513
Target5-hydroxytryptamine receptor 2A(Homo sapiens (Human))
Friedrich-Alexander University
Curated by ChEMBL
LigandPNGBDBM50119513(CHEMBL425285)
Affinity DataKi:  2.5nM. Assay description: Displacement of [3H]ketanserin from human 5-HT2A receptor expressed in HEK293 cell membranes by radioligand competition binding assay
In DepthDetails ArticlePubMed
TargetD(2) dopamine receptor(Homo sapiens (Human))
Friedrich-Alexander University
Curated by ChEMBL
LigandPNGBDBM50119513(CHEMBL425285)
Affinity DataKi:  6.40nM. Assay description: Displacement of [3H]spiperone from human dopamine D2L receptor expressed in CHO cell membranes by radioligand competition binding assay
In DepthDetails ArticlePubMed