BDBM50119799 1,11-di(1-quinoliniumyl)undecane; with dibromide ions::CHEMBL105257
SMILES C(CCCCC[n+]1cccc2ccccc12)CCCCC[n+]1cccc2ccccc12
InChI Key InChIKey=XZWPKRVTYLJQOV-UHFFFAOYSA-N
Data  2 KI  2 IC50
  Tab Delimited (TSV)   2D SDfile   Computed 3D by Vconf -m prep SDfile
Find this compound or compounds like it in BindingDB:
Activity Spreadsheet -- Enzyme Inhibition Constant Data from BindingDB
Found 4 hits for monomerid = 50119799
TargetNeuronal acetylcholine receptor subunit alpha-7(Rattus norvegicus (Rat))
University Of Kentucky
Curated by ChEMBL
LigandPNGBDBM50119799(1,11-di(1-quinoliniumyl)undecane; with dibromide i...)
Affinity DataKi:  2.58E+3nM. Assay description: Binding affinity nicotinic acetylcholine receptor alpha-7 was evaluated by its ability to inhibit [3H]methyllycaconitine ([3H]-MLA) binding to rat br...
In DepthDetails ArticlePubMed
TargetNeuronal acetylcholine receptor subunit alpha-4/beta-2(Rattus norvegicus (Rat))
University Of Kentucky
Curated by ChEMBL
LigandPNGBDBM50119799(1,11-di(1-quinoliniumyl)undecane; with dibromide i...)
Affinity DataKi:  3.78E+4nM. Assay description: Binding affinity for nicotinic acetylcholine receptor alpha4-beta2 was evaluated by its ability to inhibit [3H]NIC binding to rat brain membranes
In DepthDetails ArticlePubMed
TargetAcetylcholinesterase(Homo sapiens (Human))
Charles University
Curated by ChEMBL
LigandPNGBDBM50119799(1,11-di(1-quinoliniumyl)undecane; with dibromide i...)
Affinity DataIC50:  10nM. Assay description: Inhibition of human erythrocyte recombinant AChE by modified Ellman's method
In DepthDetails ArticlePubMed
TargetCholinesterase(Homo sapiens (Human))
Charles University
Curated by ChEMBL
LigandPNGBDBM50119799(1,11-di(1-quinoliniumyl)undecane; with dibromide i...)
Affinity DataIC50:  500nM. Assay description: Inhibition of human plasmatic BChE by modified Ellman's method
In DepthDetails ArticlePubMed