BDBM50120111 (2-Chloro-6-methyl-phenyl)-(8-morpholin-4-yl-imidazo[1,5-a]quinoxalin-4-yl)-amine::CHEMBL320967::N-(2-chloro-6-methylphenyl)-8-morpholinoimidazo[1,5-a]quinoxalin-4-amine
SMILES Cc1cccc(Cl)c1Nc1nc2ccc(cc2n2cncc12)N1CCOCC1
InChI Key InChIKey=IQXCIXCRPPWSRP-UHFFFAOYSA-N
Data  2 IC50
  Tab Delimited (TSV)   2D SDfile   Computed 3D by Vconf -m prep SDfile
Find this compound or compounds like it in BindingDB:
Activity Spreadsheet -- Enzyme Inhibition Constant Data from BindingDB
Found 2 hits for monomerid = 50120111
TargetTyrosine-protein kinase Lck(Homo sapiens (Human))
University Of Zurich
Curated by ChEMBL
LigandPNGBDBM50120111((2-Chloro-6-methyl-phenyl)-(8-morpholin-4-yl-imida...)
Affinity DataIC50:  4nM. Assay description: Inhibition of Lck
In DepthDetails ArticlePubMed
TargetTyrosine-protein kinase Lck(Homo sapiens (Human))
University Of Zurich
Curated by ChEMBL
LigandPNGBDBM50120111((2-Chloro-6-methyl-phenyl)-(8-morpholin-4-yl-imida...)
Affinity DataIC50:  4nM. Assay description: 50% inhibition of the phosphorylation of an exogenous substrate by human Lck enzyme.
In DepthDetails ArticlePubMed