BDBM50120315 CHEMBL2367888::Triterpene Glycoside analogue
SMILES C[C@H]1O[C@@H](O[C@@H]2[C@@H](O)[C@@H](CO[C@H]2O[C@H]2CC[C@@]3(C)C(CCC4C3=C[C@H](O)C35C(=O)O[C@@](C)(C6CCC(C)(C)O6)[C@@]3(O)CC[C@@]45C)C2(C)C)O[C@@H]2O[C@H](CO)[C@@H](O)[C@H](O)[C@H]2O)[C@H](O)[C@@H](O)[C@@H]1O
InChI Key InChIKey=NXTLSYMVSDURIH-WYYKWHLKSA-N
Data  1 KI
  Tab Delimited (TSV)   2D SDfile   Computed 3D by Vconf -m prep SDfile
Find this compound or compounds like it in BindingDB:
Activity Spreadsheet -- Enzyme Inhibition Constant Data from BindingDB
Found 1 hit for monomerid = 50120315
TargetC-C chemokine receptor type 5(Homo sapiens (Human))
Schering-Plough Research Institute
Curated by ChEMBL
LigandPNGBDBM50120315(CHEMBL2367888 | Triterpene Glycoside analogue)
Affinity DataKi:  3.00E+4nM. Assay description: Inhibitory activity of the compound against human CCR5 chemokine receptor (CCR5) expressed in CHO cells
In DepthDetails ArticlePubMed