BDBM50120357 3-((S)-8-Chloro-6-pyridin-2-yl-4H-3,5,10b-triaza-benzo[e]azulen-4-yl)-propionic acid methyl ester::CHEMBL111056
SMILES COC(=O)CC[C@@H]1N=C(c2ccccn2)c2cc(Cl)ccc2-n2ccnc12
InChI Key InChIKey=ZJGOOUMHKXGWSN-INIZCTEOSA-N
Data  1 KI
  Tab Delimited (TSV)   2D SDfile   Computed 3D by Vconf -m prep SDfile
Find this compound or compounds like it in BindingDB:
Activity Spreadsheet -- Enzyme Inhibition Constant Data from BindingDB
Found 1 hit for monomerid = 50120357
TargetTranslocator protein(Rattus norvegicus (rat))
Glaxosmithkline
Curated by ChEMBL
LigandPNGBDBM50120357(3-((S)-8-Chloro-6-pyridin-2-yl-4H-3,5,10b-triaza-b...)
Affinity DataKi:  79nM. Assay description: Binding affinity of the compound was determined against rat benzodiazepine (BZD) receptor
In DepthDetails ArticlePubMed