BDBM50120358 3-((S)-8-Chloro-1-methyl-6-pyridin-2-yl-4H-3,5,10b-triaza-benzo[e]azulen-4-yl)-propionic acid methyl ester::CHEMBL322701
SMILES COC(=O)CC[C@@H]1N=C(c2ccccn2)c2cc(Cl)ccc2-n2c(C)cnc12
InChI Key InChIKey=JGJJRQMHCYZKQT-KRWDZBQOSA-N
Data  1 KI
  Tab Delimited (TSV)   2D SDfile   Computed 3D by Vconf -m prep SDfile
Find this compound or compounds like it in BindingDB:
Activity Spreadsheet -- Enzyme Inhibition Constant Data from BindingDB
Found 1 hit for monomerid = 50120358
TargetTranslocator protein(Rattus norvegicus (rat))
Glaxosmithkline
Curated by ChEMBL
LigandPNGBDBM50120358(3-((S)-8-Chloro-1-methyl-6-pyridin-2-yl-4H-3,5,10b...)
Affinity DataKi:  98nM. Assay description: Binding affinity of the compound was determined against rat benzodiazepine (BZD) receptor
In DepthDetails ArticlePubMed