BDBM50120402 CHEMBL3617796
SMILES [O-][N+](=O)c1cccc(c1)-c1cn(nn1)-c1cccc(c1)[N+]([O-])=O
InChI Key InChIKey=MWWIBOHTKBNZRF-UHFFFAOYSA-N
Data  1 EC50
  Tab Delimited (TSV)   2D SDfile   Computed 3D by Vconf -m prep SDfile
Find this compound or compounds like it in BindingDB:
Activity Spreadsheet -- Enzyme Inhibition Constant Data from BindingDB
Found 1 hit for monomerid = 50120402
TargetNuclear factor erythroid 2-related factor 2(Homo sapiens (Human))
University College London
Curated by ChEMBL
LigandPNGBDBM50120402(CHEMBL3617796)
Affinity DataEC50:  1.15E+4nM. Assay description: Inhibition of kelch domain of Keap1 (unknown origin) interaction to high affinity ETGE motif from Nrf2 by fluorescence polarization assay
In DepthDetails ArticlePubMed