BDBM50120434 CHEMBL3617961
SMILES CCc1cc(OC)cc2nc(oc(=O)c12)-c1cccnc1N1CC[C@@H](C1)N(C)C
InChI Key InChIKey=RCPIMTCZGQJSGZ-HNNXBMFYSA-N
Data  1 IC50
  Tab Delimited (TSV)   2D SDfile   Computed 3D by Vconf -m prep SDfile
Find this compound or compounds like it in BindingDB:
Activity Spreadsheet -- Enzyme Inhibition Constant Data from BindingDB
Found 1 hit for monomerid = 50120434
TargetNeutrophil elastase(Homo sapiens (Human))
Bayer Healthcare
Curated by ChEMBL
LigandPNGBDBM50120434(CHEMBL3617961)
Affinity DataIC50:  7nM. Assay description: Inhibition of neutrophil elastase in human whole blood using MeO-Succ-Ala-Ala-Pro-Val-pNA as substrate after 30 mins by colorimetric analysis
In DepthDetails ArticlePubMed