BDBM50120499 CHEMBL3618038
SMILES Cc1ccnc(c1)-n1c(C)nc2n(ncc2c1=O)-c1ccccc1
InChI Key InChIKey=HXPACDQROZAKMU-UHFFFAOYSA-N
Data  1 IC50
  Tab Delimited (TSV)   2D SDfile   Computed 3D by Vconf -m prep SDfile
Find this compound or compounds like it in BindingDB:
Activity Spreadsheet -- Enzyme Inhibition Constant Data from BindingDB
Found 1 hit for monomerid = 50120499
TargetDipeptidyl peptidase 4(Homo sapiens (Human))
National Institute Of Pharmaceutical Education And Research-Ahmedabad
Curated by ChEMBL
LigandPNGBDBM50120499(CHEMBL3618038)
Affinity DataIC50:  1.06E+3nM. Assay description: Inhibition of human recombinant DPP-4 using Gly-pro-p-nitroanilide as substrate assessed as formation of p-nitroaniline after 30 mins by colorimetric...
In DepthDetails ArticlePubMed