BDBM50120583 CHEMBL3618200
SMILES NS(=O)(=O)c1ccc(Oc2cc(NC(=O)N3CCC(O)(CC3)c3ccc(F)cc3)cc(Oc3ccc(F)cc3)c2)cc1
InChI Key InChIKey=CZCDHQVZWHDWFG-UHFFFAOYSA-N
Data  2 IC50
  Tab Delimited (TSV)   2D SDfile   Computed 3D by Vconf -m prep SDfile
Find this compound or compounds like it in BindingDB:
Activity Spreadsheet -- Enzyme Inhibition Constant Data from BindingDB
Found 2 hits for monomerid = 50120583
TargetSphingosine 1-phosphate receptor 2(Rattus norvegicus (Rat))
Ono Pharmaceutical
Curated by ChEMBL
LigandPNGBDBM50120583(CHEMBL3618200)
Affinity DataIC50:  5.80nM. Assay description: Antagonist activity at rat S1P2 expressed in CHO cells assessed as Ca2+ level by FURA-2AM dye based fluorescence assay
In DepthDetails ArticlePubMed
TargetSphingosine 1-phosphate receptor 2(Homo sapiens (Human))
Ono Pharmaceutical
Curated by ChEMBL
LigandPNGBDBM50120583(CHEMBL3618200)
Affinity DataIC50:  39nM. Assay description: Antagonist activity at human S1P2 expressed in CHO cells assessed as Ca2+ level by FURA-2AM dye based fluorescence assay
In DepthDetails ArticlePubMed