BDBM50120839 CHEMBL1234040
SMILES CO[C@@H]1[C@@H](CO)O[C@H](O[C@@H]2[C@@H](CO)O[C@H](O[C@@H]3[C@@H](CO)N\C(=N\O)[C@H](O)[C@H]3O)[C@H](O)[C@H]2O)[C@H](O)[C@H]1O
InChI Key InChIKey=INFXBQXKGPGIEV-PXPLVWFRSA-N
Data  1 KI
  Tab Delimited (TSV)   2D SDfile   Computed 3D by Vconf -m prep SDfile
Find this compound or compounds like it in BindingDB:
Activity Spreadsheet -- Enzyme Inhibition Constant Data from BindingDB
Found 1 hit for monomerid = 50120839
TargetPancreatic alpha-amylase(Homo sapiens (Human))
Freie Universit£T Berlin
Curated by ChEMBL
LigandPNGBDBM50120839(CHEMBL1234040)
Affinity DataKi:  2.50E+4nM. Assay description: Inhibition of human pancreatic alpha-amylase assessed as hydrolysis of G3F by Dixon plot analysis
In DepthDetails ArticlePubMed