BDBM50120914 CHEMBL3622362
SMILES CCS(=O)(=O)N[C@H]1CC[C@@](CNC2=NS(=O)(=O)c3cccc(OC)c23)(CC1)c1ccccc1
InChI Key InChIKey=CJQQFOJFFTZBPF-RXAXNXDRSA-N
Data  1 IC50
  Tab Delimited (TSV)   2D SDfile   Computed 3D by Vconf -m prep SDfile
Find this compound or compounds like it in BindingDB:
Activity Spreadsheet -- Enzyme Inhibition Constant Data from BindingDB
Found 1 hit for monomerid = 50120914
TargetPotassium voltage-gated channel subfamily A member 5(Homo sapiens (Human))
Bristol-Myers Squibb Research And Development
Curated by ChEMBL
LigandPNGBDBM50120914(CHEMBL3622362)
Affinity DataIC50:  60nM. Assay description: Inhibition of human KV1.5 expressed in mouse L929 cells assessed as decrease in ultrarapid potassium current amplitude
In DepthDetails ArticlePubMed