BDBM50121070 CHEMBL3622017
SMILES Oc1ccc2c3CCCCCc3c(=O)oc2c1
InChI Key InChIKey=XWZHCDCMXBLZFJ-UHFFFAOYSA-N
Data  1 KI
  Tab Delimited (TSV)   2D SDfile   Computed 3D by Vconf -m prep SDfile
Find this compound or compounds like it in BindingDB:
Activity Spreadsheet -- Enzyme Inhibition Constant Data from BindingDB
Found 1 hit for monomerid = 50121070
TargetCytochrome P450 1A2(Homo sapiens (Human))
University Of Bath
Curated by ChEMBL
LigandPNGBDBM50121070(CHEMBL3622017)
Affinity DataKi:  770nM. Assay description: Inhibition of CYP1A2 in human liver microsomes
In DepthDetails ArticlePubMed