BDBM50121095 CHEMBL3622054
SMILES Oc1ccc(SCCN(c2ccc(cc2)C#N)n2cnnc2)cc1
InChI Key InChIKey=HXGRPEUTFIUGAM-UHFFFAOYSA-N
Data  1 IC50
  Tab Delimited (TSV)   2D SDfile   Computed 3D by Vconf -m prep SDfile
Find this compound or compounds like it in BindingDB:
Activity Spreadsheet -- Enzyme Inhibition Constant Data from BindingDB
Found 1 hit for monomerid = 50121095
TargetAromatase(Homo sapiens (Human))
University Of Bath
Curated by ChEMBL
LigandPNGBDBM50121095(CHEMBL3622054)
Affinity DataIC50:  0.280nM. Assay description: Inhibition of aromatase (unknown origin) expressed in JEG-3 cells
In DepthDetails ArticlePubMed