BDBM50121566 CHEMBL153319::Morpholine-4-carboxylic acid (1-{[cyano-(3,4-dichloro-benzyl)-methyl]-carbamoyl}-3-methyl-butyl)-amide
SMILES CC(C)C[C@H](NC(=O)N1CCOCC1)C(=O)N[C@@H](Cc1ccc(Cl)c(Cl)c1)C#N
InChI Key InChIKey=RZVRIXXIHBUGHA-YJBOKZPZSA-N
Data  1 IC50  1 Kd
  Tab Delimited (TSV)   2D SDfile   Computed 3D by Vconf -m prep SDfile
Find this compound or compounds like it in BindingDB:
Activity Spreadsheet -- Enzyme Inhibition Constant Data from BindingDB
Found 2 hits for monomerid = 50121566
TargetCathepsin S(Homo sapiens (Human))
Boehringer Ingelheim Pharmaceuticals
Curated by ChEMBL
LigandPNGBDBM50121566(CHEMBL153319 | Morpholine-4-carboxylic acid (1-{[c...)
Affinity DataIC50:  56nM. Assay description: Inhibitory concentration against human recombinant Cathepsin S expressed in baculovirus
In DepthDetails ArticlePubMed
TargetCathepsin S(Homo sapiens (Human))
Boehringer Ingelheim Pharmaceuticals
Curated by ChEMBL
LigandPNGBDBM50121566(CHEMBL153319 | Morpholine-4-carboxylic acid (1-{[c...)
Affinity DataKd:  7nM. Assay description: Equilibrium dissocation constant determined using fluorescence based competitive binding assay towards Cathepsin S
In DepthDetails ArticlePubMed