BDBM50121603 4-(2-{4-[(3-Benzo[1,3]dioxol-5-yl-propyl)-methyl-amino]-6-piperazin-1-yl-[1,3,5]triazin-2-ylamino}-ethyl)-phenol::CHEMBL155510
SMILES CN(CCCc1ccc2OCOc2c1)c1nc(NCCc2ccc(O)cc2)nc(n1)N1CCNCC1
InChI Key InChIKey=WVFVUQBIUYCCIB-UHFFFAOYSA-N
Data  2 KI
  Tab Delimited (TSV)   2D SDfile   Computed 3D by Vconf -m prep SDfile
Find this compound or compounds like it in BindingDB:
Activity Spreadsheet -- Enzyme Inhibition Constant Data from BindingDB
Found 2 hits for monomerid = 50121603
TargetEstrogen receptor beta(Homo sapiens (Human))
Glaxosmithkline
Curated by ChEMBL
LigandPNGBDBM50121603(4-(2-{4-[(3-Benzo[1,3]dioxol-5-yl-propyl)-methyl-a...)
Affinity DataKi:  30nM. Assay description: In vitro binding affinity towards human Estrogen receptor 2 using [3H]-17-beta-estradiol as radioligand
In DepthDetails ArticlePubMed
TargetEstrogen receptor(Homo sapiens (Human))
Glaxosmithkline
Curated by ChEMBL
LigandPNGBDBM50121603(4-(2-{4-[(3-Benzo[1,3]dioxol-5-yl-propyl)-methyl-a...)
Affinity DataKi:  560nM. Assay description: In vitro binding affinity towards human Estrogen receptor alpha using [3H]-17-beta-estradiol as radioligand
In DepthDetails ArticlePubMed