BDBM50121757 6-Amino-1H-thieno[3,2-d]pyrimidine-2,4-dione::CHEMBL12849
SMILES Nc1cc2[nH]c(=O)[nH]c(=O)c2s1
InChI Key InChIKey=ZDCSOQIEBJRGAN-UHFFFAOYSA-N
Data  1 KI
  Tab Delimited (TSV)   2D SDfile   Computed 3D by Vconf -m prep SDfile
Find this compound or compounds like it in BindingDB:
Activity Spreadsheet -- Enzyme Inhibition Constant Data from BindingDB
Found 1 hit for monomerid = 50121757
TargetThymidine phosphorylase(Homo sapiens (Human))
Attenuon
Curated by ChEMBL
LigandPNGBDBM50121757(6-Amino-1H-thieno[3,2-d]pyrimidine-2,4-dione | CHE...)
Affinity DataKi: >3.00E+5nM. Assay description: Binding affinity towards recombinant thymidine phosphorylase TP
In DepthDetails ArticlePubMed