BDBM50122091 CHEMBL152736::N-[1-[8-(3-Amino-propylamino)-octylcarbamoyl]-2-(4-hydroxy-phenyl)-ethyl]-3-phenyl-acrylamide
SMILES NCCCNCCCCCCCCNC(=O)C(Cc1ccc(O)cc1)NC(=O)\C=C\c1ccccc1
InChI Key InChIKey=SLOHJIMGRFUNLE-OBGWFSINSA-N
Data  2 KI
  Tab Delimited (TSV)   2D SDfile   Computed 3D by Vconf -m prep SDfile
Find this compound or compounds like it in BindingDB:
Activity Spreadsheet -- Enzyme Inhibition Constant Data from BindingDB
Found 2 hits for monomerid = 50122091
TargetGlutamate receptor 1(Homo sapiens (Human))
The Royal Danish School Of Pharmacy
Curated by ChEMBL
LigandPNGBDBM50122091(CHEMBL152736 | N-[1-[8-(3-Amino-propylamino)-octyl...)
Affinity DataKi:  110nM. Assay description: Inhibition of the (-80 mV) current elicited by 100 microM glutamate by simultaneous co-application in xenopus oocytes injected with GluR1 flop RNA.
In DepthDetails ArticlePubMed
TargetGlutamate receptor 1(Homo sapiens (Human))
The Royal Danish School Of Pharmacy
Curated by ChEMBL
LigandPNGBDBM50122091(CHEMBL152736 | N-[1-[8-(3-Amino-propylamino)-octyl...)
Affinity DataKi:  170nM. Assay description: Inhibition of the (-40 mV) current elicited by 100 microM glutamate by simultaneous co-application in xenopus oocytes injected with GluR1 flop RNA.
In DepthDetails ArticlePubMed