BDBM50122439 CHEMBL3622453
SMILES Cc1cc(NC(=O)c2c(O)nc(O)[nH]c2=O)no1
InChI Key InChIKey=ULRZVPBOKVPCCA-UHFFFAOYSA-N
Data  1 IC50
  Tab Delimited (TSV)   2D SDfile   Computed 3D by Vconf -m prep SDfile
Find this compound or compounds like it in BindingDB:
Activity Spreadsheet -- Enzyme Inhibition Constant Data from BindingDB
Found 1 hit for monomerid = 50122439
TargetPolymerase acidic protein(Influenza A virus (strain A/X-31 H3N2))
Universit£
Curated by ChEMBL
LigandPNGBDBM50122439(CHEMBL3622453)
Affinity DataIC50: >5.00E+5nM. Assay description: Inhibition of recombinant Influenza virus A/X-31 N-terminal RdRp PA subunit (1 to 217) expressed in Escherichia coli using single-stranded circular D...
In DepthDetails ArticlePubMed