BDBM50122451 CHEMBL3622492
SMILES CCN(C(=O)c1ccc(CNc2nc(NCCN(C)C)nc(n2)N2CCc3ccccc3C2)cc1)c1cccc(C)c1
InChI Key InChIKey=RGXRDSPPMREJGO-UHFFFAOYSA-N
Data  1 IC50
  Tab Delimited (TSV)   2D SDfile   Computed 3D by Vconf -m prep SDfile
Find this compound or compounds like it in BindingDB:
Activity Spreadsheet -- Enzyme Inhibition Constant Data from BindingDB
Found 1 hit for monomerid = 50122451
TargetA disintegrin and metalloproteinase with thrombospondin motifs 4(Homo sapiens (Human))
Glaxosmithkline
Curated by ChEMBL
LigandPNGBDBM50122451(CHEMBL3622492)
Affinity DataIC50:  8nM. Assay description: Inhibition of recombinant human ADAMTS4 (213 to 575 amino acid residues) using WAAG-3R as substrate preincubated for 15 mins followed by substrate ad...
In DepthDetails ArticlePubMed