BDBM50123004 2-Phenyl-3-[2-((R)-1-phenyl-ethylamino)-pyrimidin-4-yl]-imidazo[1,2-a]pyrimidin-7-ylamine::CHEMBL432839
SMILES C[C@@H](Nc1nccc(n1)-c1c(nc2nc(N)ccn12)-c1ccccc1)c1ccccc1
InChI Key InChIKey=KFEQXUZWOONGQK-MRXNPFEDSA-N
Data  2 IC50
  Tab Delimited (TSV)   2D SDfile   Computed 3D by Vconf -m prep SDfile
Find this compound or compounds like it in BindingDB:
Activity Spreadsheet -- Enzyme Inhibition Constant Data from BindingDB
Found 2 hits for monomerid = 50123004
TargetMitogen-activated protein kinase 11/12/13/14(Homo sapiens (Human))
Johnson & Johnson Pharmaceutical Research And Development
Curated by ChEMBL
LigandPNGBDBM50123004(2-Phenyl-3-[2-((R)-1-phenyl-ethylamino)-pyrimidin-...)
Affinity DataIC50:  2.30nM. Assay description: Inhibition of LPS-induced p38-related TNF-alpha production in human peripheral blood mononuclear cells
In DepthDetails ArticlePubMed
TargetMitogen-activated protein kinase 14(Mus musculus (mouse))
Johnson & Johnson Pharmaceutical Research And Development
Curated by ChEMBL
LigandPNGBDBM50123004(2-Phenyl-3-[2-((R)-1-phenyl-ethylamino)-pyrimidin-...)
Affinity DataIC50:  37nM. Assay description: Inhibition of murine p38 alpha kinase
In DepthDetails ArticlePubMed