BDBM50123027 CHEMBL3623212
SMILES [H][C@@]12C\C(=C/c3ccc(OCCCn4ccnc4)c(OC)c3)[C@H](O)[C@@]1(C)CC[C@@]1([H])[C@@]2([H])CC=C2C[C@@H](O)CC[C@]12C
InChI Key InChIKey=IFCWLEZORUYIOR-FURYIAKLSA-N
Data  1 IC50
  Tab Delimited (TSV)   2D SDfile   Computed 3D by Vconf -m prep SDfile
Find this compound or compounds like it in BindingDB:
Activity Spreadsheet -- Enzyme Inhibition Constant Data from BindingDB
Found 1 hit for monomerid = 50123027
TargetAromatase(Homo sapiens (Human))
American University Of Ras Al Khaimah
Curated by ChEMBL
LigandPNGBDBM50123027(CHEMBL3623212)
Affinity DataIC50:  2.40E+3nM. Assay description: Inhibition of human placental aromatase assessed as conversion of 3H2O from [1beta,2beta-3H] testosterone after 20 mins by scintillation spectrometer...
In DepthDetails ArticlePubMed