BDBM50123207 2-(3-hydroxyphenyl)-1,2'-spirobi[1H-indene]-6-ol::CHEMBL144431
SMILES Oc1ccc2C=C(c3cccc(O)c3)C3(Cc4ccccc4C3)c2c1
InChI Key InChIKey=GWRXSPPQGAVBCP-UHFFFAOYSA-N
Data  4 IC50
  Tab Delimited (TSV)   2D SDfile   Computed 3D by Vconf -m prep SDfile
Find this compound or compounds like it in BindingDB:
Activity Spreadsheet -- Enzyme Inhibition Constant Data from BindingDB
Found 4 hits for monomerid = 50123207
TargetEstrogen receptor beta(Homo sapiens (Human))
Merck Research Laboratories
Curated by ChEMBL
LigandPNGBDBM50123207(2-(3-hydroxyphenyl)-1,2'-spirobi[1H-indene]-6-ol |...)
Affinity DataIC50:  12nM. Assay description: Binding affinity for Human Estrogen receptor-beta
In DepthDetails ArticlePubMed
TargetEstrogen receptor beta(Rattus norvegicus)
Merck Research Laboratories
Curated by ChEMBL
LigandPNGBDBM50123207(2-(3-hydroxyphenyl)-1,2'-spirobi[1H-indene]-6-ol |...)
Affinity DataIC50:  15nM. Assay description: Binding affinity foor Rat Estrogen receptor-beta
In DepthDetails ArticlePubMed
TargetEstrogen receptor(RAT)
Merck Research Laboratories
Curated by ChEMBL
LigandPNGBDBM50123207(2-(3-hydroxyphenyl)-1,2'-spirobi[1H-indene]-6-ol |...)
Affinity DataIC50:  16nM. Assay description: Binding affinity for Rat Estrogen receptor-alpha
In DepthDetails ArticlePubMed
TargetEstrogen receptor(Homo sapiens (Human))
Merck Research Laboratories
Curated by ChEMBL
LigandPNGBDBM50123207(2-(3-hydroxyphenyl)-1,2'-spirobi[1H-indene]-6-ol |...)
Affinity DataIC50:  31nM. Assay description: Binding affinity for Human Estrogen receptor-alpha
In DepthDetails ArticlePubMed