BDBM50123245 (S)-2-[(3S,5R)-3-Isobutyl-5-methyl-2-oxo-4-(2-quinolin-6-yl-acetyl)-[1,4]diazepan-1-yl]-3-naphthalen-2-yl-propionic acid methyl ester::CHEMBL145823
SMILES COC(=O)[C@H](Cc1ccc2ccccc2c1)N1CC[C@@H](C)N([C@@H](CC(C)C)C1=O)C(=O)Cc1ccc2ncccc2c1
InChI Key InChIKey=DWKWIQJEGVCEIW-OBVGZQLQSA-N
Data  1 IC50
  Tab Delimited (TSV)   2D SDfile   Computed 3D by Vconf -m prep SDfile
Find this compound or compounds like it in BindingDB:
Activity Spreadsheet -- Enzyme Inhibition Constant Data from BindingDB
Found 1 hit for monomerid = 50123245
TargetIntegrin alpha-L/Integrin beta-2/Intercellular adhesion molecule 1(Homo sapiens (Human))
Novartis Institute For Biomedical Research
Curated by ChEMBL
LigandPNGBDBM50123245((S)-2-[(3S,5R)-3-Isobutyl-5-methyl-2-oxo-4-(2-quin...)
Affinity DataIC50:  2.60E+3nM. Assay description: Inhibition of LFA-1/ICAM-1 interaction in ELISA
In DepthDetails ArticlePubMed