BDBM50123285 2-Ethyl-8-methoxy-6-methoxymethoxy-3-thioxo-2,3-dihydro-imidazo[1,5-a]indol-1-one::CHEMBL151203
SMILES CCN1C(=O)c2cc3c(OC)cc(OCOC)cc3n2C1=S
InChI Key InChIKey=GCBWQUPHSUAPLO-UHFFFAOYSA-N
Data  1 IC50
  Tab Delimited (TSV)   2D SDfile   Computed 3D by Vconf -m prep SDfile
Find this compound or compounds like it in BindingDB:
Activity Spreadsheet -- Enzyme Inhibition Constant Data from BindingDB
Found 1 hit for monomerid = 50123285
TargetTumor necrosis factor receptor superfamily member 1A(Homo sapiens (Human))
Bristol-Myers Squibb Pharmaceuticals
Curated by ChEMBL
LigandPNGBDBM50123285(2-Ethyl-8-methoxy-6-methoxymethoxy-3-thioxo-2,3-di...)
Affinity DataIC50:  280nM. Assay description: Inhibition of TNF-alpha binding to TNFRc1
In DepthDetails ArticlePubMed